Testcase: test_dovecot_tcp4

Build #:20151001
Arch:i386
Release:wily
Variant:server
Artifacts
Console Log

Result History

Failure explanation

This test failure has not yet been categorized.
Log in to edit.

Test case data

testcase
test_dovecot_tcp4
testsuite
/var/lib/utah/testsuites/mail-server
returncode
1
command
python test.py
stderr
INFO:root:Cmd: ['netstat', '-4', '-ltnp']
INFO:root:Cmd output: Active Internet connections (only servers)
Proto Recv-Q Send-Q Local Address           Foreign Address         State       PID/Program name
tcp        0      0 0.0.0.0:110             0.0.0.0:*               LISTEN      515/dovecot
tcp        0      0 0.0.0.0:143             0.0.0.0:*               LISTEN      1/init
tcp        0      0 0.0.0.0:22              0.0.0.0:*               LISTEN      530/sshd
tcp        0      0 0.0.0.0:25              0.0.0.0:*               LISTEN      750/master

INFO:root:Check for the entries corresponding to dovecot
INFO:root:Check the number of dovcot etries is 4
F
======================================================================
FAIL: testDovecotTcp4 (__main__.MailServerTest)
----------------------------------------------------------------------
Traceback (most recent call last):
  File "test.py", line 41, in testDovecotTcp4
    self.assertEquals(len(output2), 4, output2)
AssertionError: ['tcp        0      0 0.0.0.0:110             0.0.0.0:*               LISTEN      515/dovecot     ']

----------------------------------------------------------------------
Ran 1 test in 0.027s

FAILED (failures=1)
command_type
testcase_test