Testcase: test_dovecot_tcp6

Build #:20150922.1
Arch:i386
Release:wily
Variant:server
Artifacts
Console Log

Result History

Failure explanation

This test failure has not yet been categorized.
Log in to edit.

Test case data

testcase
test_dovecot_tcp6
testsuite
/var/lib/utah/testsuites/mail-server
returncode
1
command
python test.py
stderr
INFO:root:Cmd: ['netstat', '-6', '-ltnp']
INFO:root:Cmd output: Active Internet connections (only servers)
Proto Recv-Q Send-Q Local Address           Foreign Address         State       PID/Program name
tcp6       0      0 :::110                  :::*                    LISTEN      506/dovecot
tcp6       0      0 :::143                  :::*                    LISTEN      1/init
tcp6       0      0 :::22                   :::*                    LISTEN      470/sshd
tcp6       0      0 :::25                   :::*                    LISTEN      760/master

INFO:root:Check for the entries corresponding to dovecot
INFO:root:Check the number of dovcot etries is 4
F
======================================================================
FAIL: testDovecotTcp6 (__main__.MailServerTest)
----------------------------------------------------------------------
Traceback (most recent call last):
  File "test.py", line 42, in testDovecotTcp6
    self.assertEquals(len(output2), 4, output2)
AssertionError: ['tcp6       0      0 :::110                  :::*                    LISTEN      506/dovecot     ']

----------------------------------------------------------------------
Ran 1 test in 0.005s

FAILED (failures=1)
command_type
testcase_test