Testcase: test_root_mount

Build #:20150605
Arch:i386
Release:wily
Variant:server
Artifacts
Console Log

Result History

Failure explanation

This test failure has not yet been categorized.
Log in to edit.

Test case data

testcase
test_root_mount
testsuite
/var/lib/utah/testsuites/raid1
returncode
1
command
python test.py
stderr
DEBUG:root:Cmd: ['df', '-h', '/']
DEBUG:root:Cmd output: Filesystem                                              Size  Used Avail Use% Mounted on
/dev/disk/by-uuid/da42081d-6501-4066-8c71-a689921e8c55  3.3G  1.4G  1.8G  45% /

F
======================================================================
FAIL: testRootMount (__main__.RAID1Test)
----------------------------------------------------------------------
Traceback (most recent call last):
  File "test.py", line 39, in testRootMount
    "/ partition not in raid device")
AssertionError: / partition not in raid device

----------------------------------------------------------------------
Ran 1 test in 0.006s

FAILED (failures=1)
command_type
testcase_test