Testcase: test_install_size

Build #:20150601
Arch:i386
Release:wily
Variant:server
Artifacts
Console Log

Result History

Failure explanation

This test failure has not yet been categorized.
Log in to edit.

Test case data

testcase
test_install_size
testsuite
/var/lib/utah/testsuites/minimal-virtual
returncode
1
command
python test.py
stderr
F
======================================================================
FAIL: testInstallSize (__main__.MinimalVirtualTest)
----------------------------------------------------------------------
Traceback (most recent call last):
  File "test.py", line 47, in testInstallSize
    self.assertTrue(used < max_install_size, "Used: %s" % (used))
AssertionError: Used: 1076008

----------------------------------------------------------------------
Ran 1 test in 0.007s

FAILED (failures=1)
command_type
testcase_test