Testcase: oem_pkg_installed

Build #:20150930
Arch:i386
Release:wily
Variant:desktop
Artifacts
Console Log

Result History

Failure explanation

This test failure has not yet been categorized.
Log in to edit.

Test case data

testcase
oem_pkg_installed
testsuite
/var/lib/utah/testsuites/usit
returncode
1
command
./test.py
stderr
INFO: Getting apt cache...
INFO: Checking if 'oem-config' is in cache...
INFO: Checking if 'oem-config' is installed...
ERROR: 'oem-config' is not installed
INFO: Checking if 'oem-config-gtk' is in cache...
INFO: Checking if 'oem-config-gtk' is installed...
ERROR: 'oem-config-gtk' is not installed
F
======================================================================
FAIL: test_oem_pkg_intalled (__main__.OemPkgInstalled)
OEM packages are installed.
----------------------------------------------------------------------
Traceback (most recent call last):
  File "./test.py", line 59, in test_oem_pkg_intalled
    raise AssertionError('Not all packages have been found '
AssertionError: Not all packages have been found and are installed

----------------------------------------------------------------------
Ran 1 test in 0.177s

FAILED (failures=1)
command_type
testcase_test