Testcase: test_root_mount

Build #:20150604
Arch:i386
Release:wily
Variant:desktop
Artifacts
Console Log

Failure explanation

This test failure has not yet been categorized.
Log in to edit.

Test case data

testcase
test_root_mount
testsuite
/var/lib/utah/testsuites/lvm
returncode
1
command
python test.py
stderr
F
======================================================================
FAIL: testRootMount (__main__.LvmTest)
----------------------------------------------------------------------
Traceback (most recent call last):
  File "test.py", line 38, in testRootMount
    self.assertTrue(l.startswith('/dev/mapper/'))
AssertionError: False is not true

----------------------------------------------------------------------
Ran 1 test in 0.003s

FAILED (failures=1)
command_type
testcase_test