Testcase: test_mysql_show_tables

Build #:20150408
Arch:i386
Release:vivid
Variant:server
Artifacts
Console Log

Result History

Failure explanation

This test failure has not yet been categorized.
Log in to edit.

Test case data

testcase
test_mysql_show_tables
testsuite
/var/lib/utah/testsuites/lamp
returncode
1
command
python test.py
stderr
F
======================================================================
FAIL: testMysqlShowTables (__main__.LampTest)
----------------------------------------------------------------------
Traceback (most recent call last):
  File "test.py", line 40, in testMysqlShowTables
    self.assertEqual(len(output.strip().split("\n")), 24)
AssertionError: 28 != 24

----------------------------------------------------------------------
Ran 1 test in 0.007s

FAILED (failures=1)
command_type
testcase_test