Testcase: check_preinstalled_list

Build #:154:20141218:20141119
Arch:mako (Nexus 4)
Release:utopic
Variant:touch_stable
Artifacts
Console Log

Failure explanation

This test failure has not yet been categorized.
Log in to edit.

Test case data

testcase
check_preinstalled_list
testsuite
/tmp/tmpWJKRti/testsuites/click_image_tests
returncode
1
command
./check_preinstalled_list.py
stderr
F
======================================================================
FAIL: testPreinstalled (__main__.ClickPreinstalled)
----------------------------------------------------------------------
Traceback (most recent call last):
  File "./check_preinstalled_list.py", line 57, in testPreinstalled
    self.assertIn(entry, list(self.image_list.keys()))
AssertionError: 'com.ubuntu.shorts' not found in ['com.ubuntu.developer.webapps.webapp-twitter', 'com.ubuntu.sudoku', 'com.ubuntu.filemanager',
'com.ubuntu.scopes.youtube', 'com.ubuntu.terminal', 'com.ubuntu.calculator', 'com.ubuntu.clock', 'com.ubuntu.weather',
'com.ubuntu.developer.webapps.webapp-amazon', 'com.ubuntu.developer.webapps.webapp-ebay', 'com.ubuntu.developer.webapps.webapp-facebook',
'com.ubuntu.music', 'com.canonical.payui', 'com.ubuntu.camera', 'com.ubuntu.dropping-letters', 'com.ubuntu.developer.webapps.webapp-gmail',
'com.ubuntu.gallery', 'com.ubuntu.reminders']

----------------------------------------------------------------------
Ran 1 test in 1.538s

FAILED (failures=1)
stdout
Search for ['com.ubuntu.developer.webapps.webapp-twitter', 'com.ubuntu.reminders', 'com.ubuntu.clock', 'com.ubuntu.filemanager',
'com.ubuntu.scopes.youtube', 'com.ubuntu.music', 'com.ubuntu.calculator', 'com.ubuntu.weather', 'com.ubuntu.developer.webapps.webapp-ebay',
'com.ubuntu.camera', 'com.ubuntu.shorts', 'com.ubuntu.developer.webapps.webapp-facebook', 'com.ubuntu.terminal', 'com.canonical.payui',
'com.ubuntu.developer.webapps.webapp-amazon', 'com.ubuntu.dropping-letters', 'com.ubuntu.developer.webapps.webapp-gmail', 'com.ubuntu.gallery',
'com.ubuntu.sudoku'] on image
command_type
testcase_test