Testcase: check_preinstalled_list

Build #:128:20141117:20141106
Arch:flo (Nexus 7 2013)
Release:utopic
Variant:touch_stable
Artifacts
Console Log

Failure explanation

This test failure has not yet been categorized.
Log in to edit.

Test case data

testcase
check_preinstalled_list
testsuite
/tmp/tmpe8bcSp/testsuites/click_image_tests
returncode
1
command
./check_preinstalled_list.py
stderr
F
======================================================================
FAIL: testPreinstalled (__main__.ClickPreinstalled)
----------------------------------------------------------------------
Traceback (most recent call last):
  File "./check_preinstalled_list.py", line 57, in testPreinstalled
    self.assertIn(entry, list(self.image_list.keys()))
AssertionError: 'com.ubuntu.developer.webapps.webapp-ebay' not found in ['com.ubuntu.clock', 'com.ubuntu.calculator', 'com.ubuntu.music',
'com.ubuntu.weather', 'com.canonical.payui', 'com.ubuntu.scopes.youtube', 'com.ubuntu.camera', 'com.ubuntu.gallery']

----------------------------------------------------------------------
Ran 1 test in 1.082s

FAILED (failures=1)
stdout
Search for ['com.ubuntu.developer.webapps.webapp-ebay', 'com.ubuntu.clock', 'com.ubuntu.calculator', 'com.ubuntu.music',
'com.ubuntu.developer.webapps.webapp-twitter', 'com.ubuntu.reminders', 'com.ubuntu.developer.webapps.webapp-gmail', 'com.ubuntu.gallery',
'com.ubuntu.developer.webapps.webapp-amazon', 'com.ubuntu.dropping-letters', 'com.ubuntu.filemanager', 'com.ubuntu.shorts', 'com.ubuntu.terminal',
'com.ubuntu.sudoku', 'com.canonical.payui', 'com.ubuntu.developer.webapps.webapp-facebook', 'com.ubuntu.scopes.youtube', 'com.ubuntu.camera',
'com.ubuntu.weather'] on image
command_type
testcase_test