Testcase: test_mod_php

Build #:20140222
Arch:i386
Release:trusty
Variant:server
Artifacts
Console Log

Result History

Failure explanation

This test failure has not yet been categorized.
Log in to edit.

Test case data

testcase
test_mod_php
testsuite
/var/lib/utah/testsuites/lamp
returncode
1
command
python test.py
stderr
ERROR:root:Failed to open test page, 'HTTP Error 404: Not Found' error
F
======================================================================
FAIL: testModPhp (__main__.LampTest)
----------------------------------------------------------------------
Traceback (most recent call last):
  File "test.py", line 41, in testModPhp
    self.fail("Failed to open to the test page")
AssertionError: Failed to open to the test page

----------------------------------------------------------------------
Ran 1 test in 0.003s

FAILED (failures=1)
command_type
testcase_test