Testcase: test_mysql_show_databases

Build #:20140221
Arch:i386
Release:trusty
Variant:server
Artifacts
Console Log

Result History

Failure explanation

This test failure has not yet been categorized.
Log in to edit.

Test case data

testcase
test_mysql_show_databases
testsuite
/var/lib/utah/testsuites/lamp
returncode
1
command
python test.py
stderr
F
======================================================================
FAIL: testMysqlShowDatabases (__main__.LampTest)
----------------------------------------------------------------------
Traceback (most recent call last):
  File "test.py", line 41, in testMysqlShowDatabases
    "test"])
AssertionError: Lists differ: ['information_schema', 'mysql'... != ['information_schema', 'mysql'...

Second list contains 1 additional elements.
First extra element 3:
test

- ['information_schema', 'mysql', 'performance_schema']
+ ['information_schema', 'mysql', 'performance_schema', 'test']
?                                                     ++++++++


----------------------------------------------------------------------
Ran 1 test in 0.006s

FAILED (failures=1)
command_type
testcase_test