Testcase: test_root_mount

Build #:20160107
Arch:amd64
Release:trusty
Variant:server
Artifacts
Console Log

Result History

Failure explanation

This test failure has not yet been categorized.
Log in to edit.

Test case data

testcase
test_root_mount
testsuite
/var/lib/utah/testsuites/raid1
returncode
1
command
python test.py
stderr
DEBUG:root:Cmd: ['df', '-h', '/']
DEBUG:root:Cmd output: Filesystem                                              Size  Used Avail Use% Mounted on
/dev/disk/by-uuid/01283575-d4c8-4d8f-97b1-12289ec8f536  3.3G  1.2G  1.9G  39% /

F
======================================================================
FAIL: testRootMount (__main__.RAID1Test)
----------------------------------------------------------------------
Traceback (most recent call last):
  File "test.py", line 39, in testRootMount
    "/ partition not in raid device")
AssertionError: / partition not in raid device

----------------------------------------------------------------------
Ran 1 test in 0.002s

FAILED (failures=1)
command_type
testcase_test