Testcase: test_kernel_module_size

Build #:20150907
Arch:amd64
Release:trusty
Variant:server
Artifacts
Console Log

Result History

Failure explanation

This test failure has not yet been categorized.
Log in to edit.

Test case data

testcase
test_kernel_module_size
testsuite
/var/lib/utah/testsuites/minimal-virtual
returncode
1
command
python test.py
stderr
F
======================================================================
FAIL: testKernelModuleSize (__main__.MinimalVirtualTest)
----------------------------------------------------------------------
Traceback (most recent call last):
  File "test.py", line 42, in testKernelModuleSize
    self.assertTrue(int(lines[0]) < 40000, lines[0])
AssertionError: 201228

----------------------------------------------------------------------
Ran 1 test in 0.125s

FAILED (failures=1)
command_type
testcase_test