Testcase: test_linux_virtual

Build #:20150618
Arch:amd64
Release:trusty
Variant:server
Artifacts
Console Log

Result History

Failure explanation

This test failure has not yet been categorized.
Log in to edit.

Test case data

testcase
test_linux_virtual
testsuite
/var/lib/utah/testsuites/minimal-virtual
returncode
1
command
python test.py
stderr
dpkg-query: no packages found matching linux-virtual
F
======================================================================
FAIL: testLinuxVirtual (__main__.MinimalVirtualTest)
----------------------------------------------------------------------
Traceback (most recent call last):
  File "test.py", line 36, in testLinuxVirtual
    self.assertEqual("linux-virtual", output)
AssertionError: 'linux-virtual' != ''

----------------------------------------------------------------------
Ran 1 test in 0.017s

FAILED (failures=1)
command_type
testcase_test