Testcase: dbus_machine_id

Build #:20150817
Arch:i386
Release:trusty
Variant:desktop
Artifacts
Console Log

Result History

Failure explanation

This test failure has not yet been categorized.
Log in to edit.

Test case data

testcase
dbus_machine_id
testsuite
/var/lib/utah/testsuites/usit
returncode
1
command
./test.py
stderr
INFO: Checking that machine id file '/etc/machine-id' or '/var/lib/dbus/machine-id' exists...
INFO: Reading file...
INFO: Couldn't open '/etc/machine-id', trying '/var/lib/dbus/machine-id'
INFO: The machine id is 'd2deef3a5f81434cd4f5757755d30e4c'
INFO: Getting last modification time...
INFO: Last modification time: Tue Aug 18 10:51:56 2015 (1439895116.68)
INFO: Machine id is 346.356117964 seconds old
F
======================================================================
FAIL: test_machine_id (__main__.MachineIdTest)
Machine Id is there and log content and age.
----------------------------------------------------------------------
Traceback (most recent call last):
  File "./test.py", line 66, in test_machine_id
    self.assertLess(age, self.EXPECTED_AGE)
AssertionError: 346.3561179637909 not less than 300

----------------------------------------------------------------------
Ran 1 test in 0.008s

FAILED (failures=1)
command_type
testcase_test